Reaction Details
TargetReverse transcriptase/RNaseH
LigandBDBM50123871
Substrate/Competitorn/a
Meas. Tech.ChEMBL_197424 (CHEMBL799813)
IC50 2300±n/a nM
Citation Ranise, ASpallarossa, ASchenone, SBruno, OBondavalli, FVargiu, LMarceddu, TMura, MLa Colla, PPani, A Design, synthesis, SAR, and molecular modeling studies of acylthiocarbamates: a novel series of potent non-nucleoside HIV-1 reverse transcriptase inhibitors structurally related to phenethylthiazolylthiourea derivatives. J Med Chem46:768-81 (2003) 
 
Reverse transcriptase/RNaseH
Name:Reverse transcriptase/RNaseH
Type:PROTEIN
Mol. Mass.:65229.15
Organism:Human immunodeficiency virus 1
Description:ChEMBL_1473730
Residue:566
BDBM50123871
NameBDBM50123871
Synonyms:(4-Chloro-phenyl)-(furan-2-carbonyl)-thiocarbamic acid O-[2-(1,3-dioxo-1,3-dihydro-isoindol-2-yl)-ethyl] ester O-2-(1,3-dioxoisoindolin-2-yl)ethyl 4-chlorophenyl(furan-2-carbonyl)carbamothioate
TypeSmall organic molecule
Emp. Form.C22H15ClN2O5S
Mol. Mass.454.883
SMILESClc1ccc(cc1)N(C(=S)OCCN1C(=O)c2ccccc2C1=O)C(=O)c1ccco1