Reaction Details
TargetHistone deacetylase 1
LigandBDBM50123955
Substrate/Competitorn/a
Meas. Tech.ChEMBL_87856 (CHEMBL877713)
IC50 40±n/a nM
Citation Bouchain, GLeit, SFrechette, SKhalil, EALavoie, RMoradei, OWoo, SHFournel, MYan, PTKalita, ATrachy-Bourget, MCBeaulieu, CLi, ZRobert, MFMacLeod, ARBesterman, JMDelorme, D Development of potential antitumor agents. Synthesis and biological evaluation of a new set of sulfonamide derivatives as histone deacetylase inhibitors. J Med Chem46:820-30 (2003) 
 
Histone deacetylase 1
Name:Histone deacetylase 1
Type:Enzyme
Mol. Mass.:55090.27
Organism:Homo sapiens (Human)
Description:Q13547
Residue:482
BDBM50123955
NameBDBM50123955
Synonyms:3-[4-(Dibenzofuran-1-sulfonylamino)-phenyl]-N-hydroxy-acrylamide | CHEMBL168652
TypeSmall organic molecule
Emp. Form.C21H16N2O5S
Mol. Mass.408.427
SMILESONC(=O)\C=C\c1ccc(NS(=O)(=O)c2cccc3oc4ccccc4c23)cc1