Reaction Details
TargetHistone deacetylase 1
LigandBDBM50123957
Substrate/Competitorn/a
Meas. Tech.ChEMBL_87856 (CHEMBL877713)
IC50 100±n/a nM
Citation Bouchain, GLeit, SFrechette, SKhalil, EALavoie, RMoradei, OWoo, SHFournel, MYan, PTKalita, ATrachy-Bourget, MCBeaulieu, CLi, ZRobert, MFMacLeod, ARBesterman, JMDelorme, D Development of potential antitumor agents. Synthesis and biological evaluation of a new set of sulfonamide derivatives as histone deacetylase inhibitors. J Med Chem46:820-30 (2003) 
 
Histone deacetylase 1
Name:Histone deacetylase 1
Type:Enzyme
Mol. Mass.:55090.27
Organism:Homo sapiens (Human)
Description:Q13547
Residue:482
BDBM50123957
NameBDBM50123957
Synonyms:(E)-5-(3-Benzenesulfonylamino-phenyl)-pent-2-en-4-ynoic acid hydroxyamide 5-(4-Benzenesulfonylamino-phenyl)-pent-2-en-4-ynoic acid hydroxyamide Oxamflatin
TypeSmall organic molecule
Emp. Form.C17H14N2O4S
Mol. Mass.342.369
SMILESONC(=O)\C=C\C#Cc1ccc(NS(=O)(=O)c2ccccc2)cc1