Reaction Details
TargetHistone deacetylase 1
LigandBDBM50123958
Substrate/Competitorn/a
Meas. Tech.ChEMBL_87856 (CHEMBL877713)
IC50 50±n/a nM
Citation Bouchain, GLeit, SFrechette, SKhalil, EALavoie, RMoradei, OWoo, SHFournel, MYan, PTKalita, ATrachy-Bourget, MCBeaulieu, CLi, ZRobert, MFMacLeod, ARBesterman, JMDelorme, D Development of potential antitumor agents. Synthesis and biological evaluation of a new set of sulfonamide derivatives as histone deacetylase inhibitors. J Med Chem46:820-30 (2003) 
 
Histone deacetylase 1
Name:Histone deacetylase 1
Type:Enzyme
Mol. Mass.:55090.27
Organism:Homo sapiens (Human)
Description:Q13547
Residue:482
BDBM50123958
NameBDBM50123958
Synonyms:3-[4-(3,4-Dimethoxy-phenylsulfamoyl)-phenyl]-N-hydroxy-acrylamide US8796330, 98
TypeSmall organic molecule
Emp. Form.C17H18N2O6S
Mol. Mass.378.4
SMILESCOc1ccc(NS(=O)(=O)c2ccc(\C=C\C(=O)NO)cc2)cc1OC