Reaction Details
TargetMu-type opioid receptor
LigandBDBM50124001
Substrate/Competitorn/a
Meas. Tech.ChEMBL_145281 (CHEMBL751217)
Ki 8.8±n/a nM
Citation Wentland, MPYe, YCioffi, CLLou, RZhou, QXu, GDuan, WDehnhardt, CMSun, XCohen, DJBidlack, JM Syntheses and opioid receptor binding affinities of 8-amino-2,6-methano-3-benzazocines. J Med Chem46:838-49 (2003) 
 
Mu-type opioid receptor
Name:Mu-type opioid receptor
Type:Enzyme Catalytic Domain
Mol. Mass.:11165.58
Organism:GUINEA PIG
Description:P97266
Residue:98
BDBM50124001
NameBDBM50124001
Synonyms:(4-Chloro-benzyl)-(3-cyclopropylmethyl-6,11-dimethyl-1,2,3,4,5,6-hexahydro-2,6-methano-benzo[d]azocin-8-yl)-amine | CHEMBL353938
TypeSmall organic molecule
Emp. Form.C25H31ClN2
Mol. Mass.394.98
SMILESC[C@H]1C2Cc3ccc(NCc4ccc(Cl)cc4)cc3[C@@]1(C)CCN2CC1CC1