Reaction Details
TargetDelta-type opioid receptor
LigandBDBM50124004
Substrate/Competitorn/a
Meas. Tech.ChEMBL_147150 (CHEMBL758175)
Ki 250±n/a nM
Citation Wentland, MPYe, YCioffi, CLLou, RZhou, QXu, GDuan, WDehnhardt, CMSun, XCohen, DJBidlack, JM Syntheses and opioid receptor binding affinities of 8-amino-2,6-methano-3-benzazocines. J Med Chem46:838-49 (2003) 
 
Delta-type opioid receptor
Name:Delta-type opioid receptor
Type:G Protein-Coupled Receptor (GPCR)
Mol. Mass.:40382.98
Organism:Homo sapiens (Human)
Description:Competition binding assays were carried out using membrane preparations from transfected HN9.10 cells that constitutively expressed the delta opioid receptor.
Residue:372
BDBM50124004
NameBDBM50124004
Synonyms:13-cyclopropylmethyl-1,16-dimethyl-(1S,16R)-5,13-diazatetracyclo[10.3.1.02,10.04,8]hexadeca-2(10),3,6,8-tetraene | CHEMBL170384
TypeSmall organic molecule
Emp. Form.C20H26N2
Mol. Mass.294.4338
SMILESC[C@H]1C2Cc3cc4cc[nH]c4cc3[C@@]1(C)CCN2CC1CC1