Reaction Details
TargetMu-type opioid receptor
LigandBDBM50123996
Substrate/Competitorn/a
Meas. Tech.ChEMBL_145281 (CHEMBL751217)
Ki 3±n/a nM
Citation Wentland, MPYe, YCioffi, CLLou, RZhou, QXu, GDuan, WDehnhardt, CMSun, XCohen, DJBidlack, JM Syntheses and opioid receptor binding affinities of 8-amino-2,6-methano-3-benzazocines. J Med Chem46:838-49 (2003) 
 
Mu-type opioid receptor
Name:Mu-type opioid receptor
Type:Enzyme Catalytic Domain
Mol. Mass.:11165.58
Organism:GUINEA PIG
Description:P97266
Residue:98
BDBM50123996
NameBDBM50123996
Synonyms:(4-Chloro-phenyl)-(3-cyclopropylmethyl-6,11-dimethyl-1,2,3,4,5,6-hexahydro-2,6-methano-benzo[d]azocin-8-yl)-amine | CHEMBL169030
TypeSmall organic molecule
Emp. Form.C24H29ClN2
Mol. Mass.380.953
SMILESC[C@H]1C2Cc3ccc(Nc4ccc(Cl)cc4)cc3[C@@]1(C)CCN2CC1CC1