Reaction Details
TargetDelta-type opioid receptor
LigandBDBM50123997
Substrate/Competitorn/a
Meas. Tech.ChEMBL_147150 (CHEMBL758175)
Ki 21±n/a nM
Citation Wentland, MPYe, YCioffi, CLLou, RZhou, QXu, GDuan, WDehnhardt, CMSun, XCohen, DJBidlack, JM Syntheses and opioid receptor binding affinities of 8-amino-2,6-methano-3-benzazocines. J Med Chem46:838-49 (2003) 
 
Delta-type opioid receptor
Name:Delta-type opioid receptor
Type:G Protein-Coupled Receptor (GPCR)
Mol. Mass.:40382.98
Organism:Homo sapiens (Human)
Description:Competition binding assays were carried out using membrane preparations from transfected HN9.10 cells that constitutively expressed the delta opioid receptor.
Residue:372
BDBM50123997
NameBDBM50123997
Synonyms:(3-Cyclopropylmethyl-6,11-dimethyl-1,2,3,4,5,6-hexahydro-2,6-methano-benzo[d]azocin-8-yl)-pyridin-3-yl-amine | CHEMBL422563
TypeSmall organic molecule
Emp. Form.C23H29N3
Mol. Mass.347.4965
SMILESC[C@H]1C2Cc3ccc(Nc4cccnc4)cc3[C@@]1(C)CCN2CC1CC1