Reaction Details
TargetKappa-type opioid receptor
LigandBDBM50001040
Substrate/Competitorn/a
Meas. Tech.ChEMBL_146518 (CHEMBL882417)
Ki 76±n/a nM
Citation Wentland, MPYe, YCioffi, CLLou, RZhou, QXu, GDuan, WDehnhardt, CMSun, XCohen, DJBidlack, JM Syntheses and opioid receptor binding affinities of 8-amino-2,6-methano-3-benzazocines. J Med Chem46:838-49 (2003) 
 
Kappa-type opioid receptor
Name:Kappa-type opioid receptor
Type:G Protein-Coupled Receptor (GPCR)
Mol. Mass.:42744.99
Organism:Cavia porcellus (domestic guinea pig)
Description:P41144
Residue:380
BDBM50001040
NameBDBM50001040
Synonyms:6,11-Dimethyl-3-(3-methyl-butyl)-1,2,3,4,5,6-hexahydro-2,6-methano-benzo[d]azocin-8-ol | CHEMBL2021605
TypeSmall organic molecule
Emp. Form.C17H23NO
Mol. Mass.257.3706
SMILES[H][C@@]12Cc3ccc(O)cc3[C@@](C)(CN1CC1CC1)[C@@H]2C