Reaction Details
TargetDelta-type opioid receptor
LigandBDBM50085031
Substrate/Competitorn/a
Meas. Tech.ChEMBL_147150 (CHEMBL758175)
Ki 460±n/a nM
Citation Wentland, MPYe, YCioffi, CLLou, RZhou, QXu, GDuan, WDehnhardt, CMSun, XCohen, DJBidlack, JM Syntheses and opioid receptor binding affinities of 8-amino-2,6-methano-3-benzazocines. J Med Chem46:838-49 (2003) 
 
Delta-type opioid receptor
Name:Delta-type opioid receptor
Type:G Protein-Coupled Receptor (GPCR)
Mol. Mass.:40382.98
Organism:Homo sapiens (Human)
Description:Competition binding assays were carried out using membrane preparations from transfected HN9.10 cells that constitutively expressed the delta opioid receptor.
Residue:372
BDBM50085031
NameBDBM50085031
Synonyms:((6S,11R)-3-Cyclopropylmethyl-6,11-dimethyl-1,2,3,4,5,6-hexahydro-2,6-methano-benzo[d]azocin-8-yl)-isopropyl-amine CHEMBL55434
TypeSmall organic molecule
Emp. Form.C21H32N2
Mol. Mass.312.4922
SMILESCC(C)Nc1ccc2CC3[C@H](C)[C@](C)(CCN3CC3CC3)c2c1