Reaction Details
TargetKappa-type opioid receptor
LigandBDBM50123992
Substrate/Competitorn/a
Meas. Tech.ChEMBL_147242 (CHEMBL755510)
EC50 5.9±n/a nM
Citation Wentland, MPYe, YCioffi, CLLou, RZhou, QXu, GDuan, WDehnhardt, CMSun, XCohen, DJBidlack, JM Syntheses and opioid receptor binding affinities of 8-amino-2,6-methano-3-benzazocines. J Med Chem46:838-49 (2003) 
 
Kappa-type opioid receptor
Name:Kappa-type opioid receptor
Type:G Protein-Coupled Receptor (GPCR)
Mol. Mass.:42648.76
Organism:Homo sapiens (Human)
Description:P41145
Residue:380
BDBM50123992
NameBDBM50123992
Synonyms:3-Cyclopropylmethyl-6-ethyl-11-methyl-8-phenylamino-3,4,5,6-tetrahydro-2H-2,6-methano-benzo[d]azocin-1-one | CHEMBL352965
TypeSmall organic molecule
Emp. Form.C25H30N2O
Mol. Mass.374.5185
SMILESCC[C@]12CCN(CC3CC3)C([C@@H]1C)C(=O)c1ccc(Nc3ccccc3)cc21