Reaction Details
TargetDelta-type opioid receptor
LigandBDBM50123994
Substrate/Competitorn/a
Meas. Tech.ChEMBL_147150 (CHEMBL758175)
Ki 81±n/a nM
Citation Wentland, MPYe, YCioffi, CLLou, RZhou, QXu, GDuan, WDehnhardt, CMSun, XCohen, DJBidlack, JM Syntheses and opioid receptor binding affinities of 8-amino-2,6-methano-3-benzazocines. J Med Chem46:838-49 (2003) 
 
Delta-type opioid receptor
Name:Delta-type opioid receptor
Type:G Protein-Coupled Receptor (GPCR)
Mol. Mass.:40382.98
Organism:Homo sapiens (Human)
Description:Competition binding assays were carried out using membrane preparations from transfected HN9.10 cells that constitutively expressed the delta opioid receptor.
Residue:372
BDBM50123994
NameBDBM50123994
Synonyms:8-Amino-3-cyclopropylmethyl-6-ethyl-11-methyl-3,4,5,6-tetrahydro-2H-2,6-methano-benzo[d]azocin-1-one | CHEMBL169346
TypeSmall organic molecule
Emp. Form.C19H26N2O
Mol. Mass.298.4225
SMILESCC[C@]12CCN(CC3CC3)C([C@@H]1C)C(=O)c1ccc(N)cc21