Reaction Details
TargetKappa-type opioid receptor
LigandBDBM50123993
Substrate/Competitorn/a
Meas. Tech.ChEMBL_146518 (CHEMBL882417)
Ki 1±n/a nM
Citation Wentland, MPYe, YCioffi, CLLou, RZhou, QXu, GDuan, WDehnhardt, CMSun, XCohen, DJBidlack, JM Syntheses and opioid receptor binding affinities of 8-amino-2,6-methano-3-benzazocines. J Med Chem46:838-49 (2003) 
 
Kappa-type opioid receptor
Name:Kappa-type opioid receptor
Type:G Protein-Coupled Receptor (GPCR)
Mol. Mass.:42744.99
Organism:Cavia porcellus (domestic guinea pig)
Description:P41144
Residue:380
BDBM50123993
NameBDBM50123993
Synonyms:(3-Cyclopropylmethyl-6,11-dimethyl-1,2,3,4,5,6-hexahydro-2,6-methano-benzo[d]azocin-8-yl)-(3-methoxy-phenyl)-amine | CHEMBL169345
TypeSmall organic molecule
Emp. Form.C25H32N2O
Mol. Mass.376.5344
SMILESCOc1cccc(Nc2ccc3CC4[C@H](C)[C@](C)(CCN4CC4CC4)c3c2)c1