Reaction Details
TargetKappa-type opioid receptor
LigandBDBM83436
Substrate/Competitorn/a
Meas. Tech.ChEMBL_147242 (CHEMBL755510)
EC50 18±n/a nM
Citation Wentland, MPYe, YCioffi, CLLou, RZhou, QXu, GDuan, WDehnhardt, CMSun, XCohen, DJBidlack, JM Syntheses and opioid receptor binding affinities of 8-amino-2,6-methano-3-benzazocines. J Med Chem46:838-49 (2003) 
 
Kappa-type opioid receptor
Name:Kappa-type opioid receptor
Type:G Protein-Coupled Receptor (GPCR)
Mol. Mass.:42648.76
Organism:Homo sapiens (Human)
Description:P41145
Residue:380
BDBM83436
NameBDBM83436
Synonyms:2-(3,4-dichlorophenyl)-N-methyl-N-[(5R,7S,8S)-7-(1-pyrrolidinyl)-1-oxaspiro[4.5]decan-8-yl]acetamide;methanesulfonic acid 2-(3,4-dichlorophenyl)-N-methyl-N-[(5R,7S,8S)-7-pyrrolidin-1-yl-1-oxaspiro[4.5]decan-8-yl]ethanamide;methanesulfonic acid MLS002153429 Spiradoline cid_55651
TypeSmall organic molecule
Emp. Form.C22H30Cl2N2O2
Mol. Mass.425.392
SMILESCN([C@H]1CC[C@@]2(CCCO2)C[C@@H]1N1CCCC1)C(=O)Cc1ccc(Cl)c(Cl)c1