Reaction Details
TargetKappa-type opioid receptor
LigandBDBM50123997
Substrate/Competitorn/a
Meas. Tech.ChEMBL_147242 (CHEMBL755510)
EC50 10±n/a nM
Citation Wentland, MPYe, YCioffi, CLLou, RZhou, QXu, GDuan, WDehnhardt, CMSun, XCohen, DJBidlack, JM Syntheses and opioid receptor binding affinities of 8-amino-2,6-methano-3-benzazocines. J Med Chem46:838-49 (2003) 
 
Kappa-type opioid receptor
Name:Kappa-type opioid receptor
Type:G Protein-Coupled Receptor (GPCR)
Mol. Mass.:42648.76
Organism:Homo sapiens (Human)
Description:P41145
Residue:380
BDBM50123997
NameBDBM50123997
Synonyms:(3-Cyclopropylmethyl-6,11-dimethyl-1,2,3,4,5,6-hexahydro-2,6-methano-benzo[d]azocin-8-yl)-pyridin-3-yl-amine | CHEMBL422563
TypeSmall organic molecule
Emp. Form.C23H29N3
Mol. Mass.347.4965
SMILESC[C@H]1C2Cc3ccc(Nc4cccnc4)cc3[C@@]1(C)CCN2CC1CC1