Reaction Details
TargetCalpain-1 catalytic subunit
LigandBDBM50124012
Substrate/Competitorn/a
Meas. Tech.ChEMBL_139013 (CHEMBL744609)
IC50 14±n/a nM
Citation Inoue, JNakamura, MCui, YSSakai, YSakai, OHill, JRWang, KKYuen, PW Structure-activity relationship study and drug profile of N-(4-fluorophenylsulfonyl)-L-valyl-L-leucinal (SJA6017) as a potent calpain inhibitor. J Med Chem46:868-71 (2003) 
 
Calpain-1 catalytic subunit
Name:Calpain-1 catalytic subunit
Type:Protein
Mol. Mass.:81880.51
Organism:Homo sapiens (Human)
Description:n/a
Residue:714
BDBM50124012
NameBDBM50124012
Synonyms:2-(4-Chloro-benzenesulfonylamino)-N-(1-formyl-2-phenyl-ethyl)-3-methyl-butyramide | CHEMBL167224
TypeSmall organic molecule
Emp. Form.C20H23ClN2O4S
Mol. Mass.422.926
SMILESCC(C)[C@H](NS(=O)(=O)c1ccc(Cl)cc1)C(=O)N[C@H](Cc1ccccc1)C=O