Reaction Details
TargetCathepsin B
LigandBDBM50124028
Substrate/Competitorn/a
Meas. Tech.ChEMBL_47426 (CHEMBL662613)
Ki 70.0±n/a nM
Citation Donkor, IOKorukonda, RHuang, TLLeCour, L Peptidyl aldehyde inhibitors of calpain incorporating P2-proline mimetics. Bioorg Med Chem Lett13:783-4 (2003) Cathepsin B
Name:Cathepsin B
Type:Enzyme
Mol. Mass.:37819.69
Organism:Homo sapiens (Human)
Description:gi_63102437
Residue:339
BDBM50124028
NameBDBM50124028
Synonyms:(S)-4-Methyl-2-(toluene-4-sulfonylamino)-pentanoic acid (1-benzyl-2-oxo-ethyl)-amide | CHEMBL350182
TypeSmall organic molecule
Emp. Form.C22H28N2O4S
Mol. Mass.416.534
SMILESCC(C)C[C@H](NS(=O)(=O)c1ccc(C)cc1)C(=O)NC(Cc1ccccc1)C=O