Reaction Details
TargetGenome polyprotein
LigandBDBM50124048
Substrate/Competitorn/a
Meas. Tech.ChEBML_143487
IC50 80±n/a nM
Citation Glunz, PWDouty, BDDecicco, CP Design and synthesis of bicyclic pyrimidinone-based HCV NS3 protease inhibitors. Bioorg Med Chem Lett13:785-8 (2003) Genome polyprotein
Name:Genome polyprotein
Type:Protein
Mol. Mass.:67067.41
Organism:Hepatitis C virus
Description:A3EZI9
Residue:631
BDBM50124048
NameBDBM50124048
Synonyms:2-((R)-3-{(S)-8-Methyl-4-oxo-3-(3-trifluoromethyl-benzylamino)-6-[(R)-1-((S)-6,9,9-trimethyl-3,5-dioxa-4-bora-tricyclo[6.1.1.0*2,6*]dec-4-yl)-propylcarbamoyl]-4,6,7,8-tetrahydro-pyrrolo[1,2-a]pyrimidin-8-yl}-ureido)-benzoic acid methyl ester | CHEMBL352719
TypeSmall organic molecule
Emp. Form.C39H46BF3N6O7
Mol. Mass.778.625
SMILESCC[C@H](NC(=O)[C@@H]1C[C@@](C)(NC(=O)Nc2ccccc2C(=O)OC)c2ncc(NCc3cccc(c3)C(F)(F)F)c(=O)n12)B1OC2C3CC(C[C@]2(C)O1)C3(C)C