Reaction Details
TargetProthrombin
LigandBDBM50067797
Substrate/Competitorn/a
Meas. Tech.ChEBML_208511
Ki 0.800000±n/a nM
Citation Sanderson, PEStanton, MGDorsey, BDLyle, TAMcDonough, CSanders, WMSavage, KLNaylor-Olsen, AMKrueger, JALewis, SDLucas, BJLynch, JJYan, Y Azaindoles: moderately basic P1 groups for enhancing the selectivity of thrombin inhibitors. Bioorg Med Chem Lett13:795-8 (2003) Prothrombin
Name:Prothrombin
Type:Protein
Mol. Mass.:70029.57
Organism:Homo sapiens (Human)
Description:P00734
Residue:622
BDBM50067797
NameBDBM50067797
Synonyms:CHEMBL19080 N-(6-Amino-2-methyl-pyridin-3-ylmethyl)-2-(6-methyl-2-oxo-3-phenethylamino-2H-pyrazin-1-yl)-acetamide | US11584714, Compound 1488
TypeSmall organic molecule
Emp. Form.C22H26N6O2
Mol. Mass.406.4808
SMILESCc1nc(N)ccc1CNC(=O)Cn1c(C)cnc(NCCc2ccccc2)c1=O