Reaction Details
TargetProthrombin
LigandBDBM50124086
Substrate/Competitorn/a
Meas. Tech.ChEBML_208511
Ki 1.2±n/a nM
Citation Sanderson, PEStanton, MGDorsey, BDLyle, TAMcDonough, CSanders, WMSavage, KLNaylor-Olsen, AMKrueger, JALewis, SDLucas, BJLynch, JJYan, Y Azaindoles: moderately basic P1 groups for enhancing the selectivity of thrombin inhibitors. Bioorg Med Chem Lett13:795-8 (2003) Prothrombin
Name:Prothrombin
Type:Protein
Mol. Mass.:70029.57
Organism:Homo sapiens (Human)
Description:P00734
Residue:622
BDBM50124086
NameBDBM50124086
Synonyms:2-[6-Methyl-2-oxo-3-(2-pyridin-2-yl-ethylamino)-2H-pyrazin-1-yl]-N-(1H-pyrrolo[2,3-c]pyridin-5-ylmethyl)-acetamide | CHEMBL355314
TypeSmall organic molecule
Emp. Form.C22H23N7O2
Mol. Mass.417.4637
SMILESCc1cnc(NCCc2ccccn2)c(=O)n1CC(=O)NCc1cc2cc[nH]c2cn1