Reaction Details
TargetPeroxisome proliferator-activated receptor gamma
LigandBDBM50124378
Substrate/Competitorn/a
Meas. Tech.ChEBML_154053
Ki 22±n/a nM
Citation Adams, ADYuen, WHu, ZSantini, CJones, ABMacNaul, KLBerger, JPDoebber, TWMoller, DE Amphipathic 3-phenyl-7-propylbenzisoxazoles; human pPaR gamma, delta and alpha agonists. Bioorg Med Chem Lett13:931-5 (2003) Peroxisome proliferator-activated receptor gamma
Name:Peroxisome proliferator-activated receptor gamma
Type:Nuclear Receptor
Mol. Mass.:57613.46
Organism:Homo sapiens (Human)
Description:P37231
Residue:505
BDBM50124378
NameBDBM50124378
Synonyms:2-{4-[3-(3-Phenyl-7-propyl-benzo[d]isoxazol-6-yloxy)-propoxy]-phenoxy}-propionic acid | CHEMBL172490
TypeSmall organic molecule
Emp. Form.C28H29NO6
Mol. Mass.475.533
SMILESCCCc1c(OCCCOc2ccc(OC(C)C(O)=O)cc2)ccc2c(noc12)-c1ccccc1