Reaction Details
TargetPeroxisome proliferator-activated receptor alpha
LigandBDBM50124378
Substrate/Competitorn/a
Meas. Tech.ChEMBL_153242 (CHEMBL764654)
EC50 2±n/a nM
Citation Adams, ADYuen, WHu, ZSantini, CJones, ABMacNaul, KLBerger, JPDoebber, TWMoller, DE Amphipathic 3-phenyl-7-propylbenzisoxazoles; human pPaR gamma, delta and alpha agonists. Bioorg Med Chem Lett13:931-5 (2003) Peroxisome proliferator-activated receptor alpha
Name:Peroxisome proliferator-activated receptor alpha
Type:Enzyme
Mol. Mass.:52222.08
Organism:Homo sapiens (Human)
Description:Q07869
Residue:468
BDBM50124378
NameBDBM50124378
Synonyms:2-{4-[3-(3-Phenyl-7-propyl-benzo[d]isoxazol-6-yloxy)-propoxy]-phenoxy}-propionic acid | CHEMBL172490
TypeSmall organic molecule
Emp. Form.C28H29NO6
Mol. Mass.475.533
SMILESCCCc1c(OCCCOc2ccc(OC(C)C(O)=O)cc2)ccc2c(noc12)-c1ccccc1