Reaction Details
TargetPeroxisome proliferator-activated receptor alpha
LigandBDBM50124385
Substrate/Competitorn/a
Meas. Tech.ChEMBL_153549 (CHEMBL766090)
Ki 5.2±n/a nM
Citation Adams, ADYuen, WHu, ZSantini, CJones, ABMacNaul, KLBerger, JPDoebber, TWMoller, DE Amphipathic 3-phenyl-7-propylbenzisoxazoles; human pPaR gamma, delta and alpha agonists. Bioorg Med Chem Lett13:931-5 (2003) Peroxisome proliferator-activated receptor alpha
Name:Peroxisome proliferator-activated receptor alpha
Type:Enzyme
Mol. Mass.:52222.08
Organism:Homo sapiens (Human)
Description:Q07869
Residue:468
BDBM50124385
NameBDBM50124385
Synonyms:3-[4-(3-Phenyl-7-propyl-benzo[d]isoxazol-6-yloxy)-butoxy]-benzoic acid | CHEMBL369053
TypeSmall organic molecule
Emp. Form.C27H27NO5
Mol. Mass.445.507
SMILESCCCc1c(OCCCCOc2cccc(c2)C(O)=O)ccc2c(noc12)-c1ccccc1