Reaction Details
TargetPeroxisome proliferator-activated receptor gamma
LigandBDBM50124387
Substrate/Competitorn/a
Meas. Tech.ChEBML_154053
Ki 26±n/a nM
Citation Adams, ADYuen, WHu, ZSantini, CJones, ABMacNaul, KLBerger, JPDoebber, TWMoller, DE Amphipathic 3-phenyl-7-propylbenzisoxazoles; human pPaR gamma, delta and alpha agonists. Bioorg Med Chem Lett13:931-5 (2003) Peroxisome proliferator-activated receptor gamma
Name:Peroxisome proliferator-activated receptor gamma
Type:Nuclear Receptor
Mol. Mass.:57613.46
Organism:Homo sapiens (Human)
Description:P37231
Residue:505
BDBM50124387
NameBDBM50124387
Synonyms:2-Methyl-2-{3-[4-(3-phenyl-7-propyl-benzo[d]isoxazol-6-yloxy)-butoxy]-phenyl}-propionic acid | CHEMBL435715
TypeSmall organic molecule
Emp. Form.C30H33NO5
Mol. Mass.487.5867
SMILESCCCc1c(OCCCCOc2cccc(c2)C(C)(C)C(O)=O)ccc2c(noc12)-c1ccccc1