Reaction Details
TargetPeroxisome proliferator-activated receptor alpha
LigandBDBM50124381
Substrate/Competitorn/a
Meas. Tech.ChEBML_153549
Ki 76±n/a nM
Citation Adams, ADYuen, WHu, ZSantini, CJones, ABMacNaul, KLBerger, JPDoebber, TWMoller, DE Amphipathic 3-phenyl-7-propylbenzisoxazoles; human pPaR gamma, delta and alpha agonists. Bioorg Med Chem Lett13:931-5 (2003) Peroxisome proliferator-activated receptor alpha
Name:Peroxisome proliferator-activated receptor alpha
Type:Enzyme
Mol. Mass.:52222.08
Organism:Homo sapiens (Human)
Description:Q07869
Residue:468
BDBM50124381
NameBDBM50124381
Synonyms:CHEMBL172718 | {3-[3-(3-Phenyl-7-propyl-benzo[d]isoxazol-6-yloxy)-propoxy]-phenyl}-acetic acid
TypeSmall organic molecule
Emp. Form.C27H27NO5
Mol. Mass.445.507
SMILESCCCc1c(OCCCOc2cccc(CC(O)=O)c2)ccc2c(noc12)-c1ccccc1