Reaction Details
TargetPeroxisome proliferator-activated receptor gamma
LigandBDBM50124374
Substrate/Competitorn/a
Meas. Tech.ChEBML_154053
Ki 8.9±n/a nM
Citation Adams, ADYuen, WHu, ZSantini, CJones, ABMacNaul, KLBerger, JPDoebber, TWMoller, DE Amphipathic 3-phenyl-7-propylbenzisoxazoles; human pPaR gamma, delta and alpha agonists. Bioorg Med Chem Lett13:931-5 (2003) Peroxisome proliferator-activated receptor gamma
Name:Peroxisome proliferator-activated receptor gamma
Type:Nuclear Receptor
Mol. Mass.:57613.46
Organism:Homo sapiens (Human)
Description:P37231
Residue:505
BDBM50124374
NameBDBM50124374
Synonyms:3-{4-[4-(3-Phenyl-7-propyl-benzo[d]isoxazol-6-yloxy)-butoxy]-phenyl}-propionic acid | CHEMBL172931
TypeSmall organic molecule
Emp. Form.C29H31NO5
Mol. Mass.473.5601
SMILESCCCc1c(OCCCCOc2ccc(CCC(O)=O)cc2)ccc2c(noc12)-c1ccccc1