Reaction Details
TargetPeroxisome proliferator-activated receptor alpha
LigandBDBM50124386
Substrate/Competitorn/a
Meas. Tech.ChEMBL_153549 (CHEMBL766090)
Ki 7±n/a nM
Citation Adams, ADYuen, WHu, ZSantini, CJones, ABMacNaul, KLBerger, JPDoebber, TWMoller, DE Amphipathic 3-phenyl-7-propylbenzisoxazoles; human pPaR gamma, delta and alpha agonists. Bioorg Med Chem Lett13:931-5 (2003) Peroxisome proliferator-activated receptor alpha
Name:Peroxisome proliferator-activated receptor alpha
Type:Enzyme
Mol. Mass.:52222.08
Organism:Homo sapiens (Human)
Description:Q07869
Residue:468
BDBM50124386
NameBDBM50124386
Synonyms:CHEMBL367311 | {4-[4-(3-Phenyl-7-propyl-benzo[d]isoxazol-6-yloxy)-butoxy]-phenyl}-acetic acid
TypeSmall organic molecule
Emp. Form.C28H29NO5
Mol. Mass.459.5336
SMILESCCCc1c(OCCCCOc2ccc(CC(O)=O)cc2)ccc2c(noc12)-c1ccccc1