Reaction Details
TargetPeroxisome proliferator-activated receptor gamma
LigandBDBM50124369
Substrate/Competitorn/a
Meas. Tech.ChEMBL_154361 (CHEMBL756623)
Ki 11±n/a nM
Citation Adams, ADYuen, WHu, ZSantini, CJones, ABMacNaul, KLBerger, JPDoebber, TWMoller, DE Amphipathic 3-phenyl-7-propylbenzisoxazoles; human pPaR gamma, delta and alpha agonists. Bioorg Med Chem Lett13:931-5 (2003) Peroxisome proliferator-activated receptor gamma
Name:Peroxisome proliferator-activated receptor gamma
Type:Nuclear Receptor
Mol. Mass.:57613.46
Organism:Homo sapiens (Human)
Description:P37231
Residue:505
BDBM50124369
NameBDBM50124369
Synonyms:CHEMBL367019 | {3-Chloro-4-[3-(3-phenyl-7-propyl-benzo[d]isoxazol-6-yloxy)-propylsulfanyl]-phenyl}-acetic acid
TypeSmall organic molecule
Emp. Form.C27H26ClNO4S
Mol. Mass.496.018
SMILESCCCc1c(OCCCSc2ccc(CC(O)=O)cc2Cl)ccc2c(noc12)-c1ccccc1