Reaction Details
TargetPeroxisome proliferator-activated receptor delta
LigandBDBM50124372
Substrate/Competitorn/a
Meas. Tech.ChEBML_154031
Ki 265±n/a nM
Citation Adams, ADYuen, WHu, ZSantini, CJones, ABMacNaul, KLBerger, JPDoebber, TWMoller, DE Amphipathic 3-phenyl-7-propylbenzisoxazoles; human pPaR gamma, delta and alpha agonists. Bioorg Med Chem Lett13:931-5 (2003) Peroxisome proliferator-activated receptor delta
Name:Peroxisome proliferator-activated receptor delta
Type:Enzyme
Mol. Mass.:49910.45
Organism:Homo sapiens (Human)
Description:Q03181
Residue:441
BDBM50124372
NameBDBM50124372
Synonyms:(E)-3-{4-[4-(3-Phenyl-7-propyl-benzo[d]isoxazol-6-yloxy)-butoxy]-phenyl}-acrylic acid | CHEMBL172492
TypeSmall organic molecule
Emp. Form.C29H29NO5
Mol. Mass.471.5443
SMILESCCCc1c(OCCCCOc2ccc(\C=C\C(O)=O)cc2)ccc2c(noc12)-c1ccccc1