Reaction Details
TargetPeroxisome proliferator-activated receptor delta
LigandBDBM50124391
Substrate/Competitorn/a
Meas. Tech.ChEBML_154031
Ki 47±n/a nM
Citation Adams, ADYuen, WHu, ZSantini, CJones, ABMacNaul, KLBerger, JPDoebber, TWMoller, DE Amphipathic 3-phenyl-7-propylbenzisoxazoles; human pPaR gamma, delta and alpha agonists. Bioorg Med Chem Lett13:931-5 (2003) Peroxisome proliferator-activated receptor delta
Name:Peroxisome proliferator-activated receptor delta
Type:Enzyme
Mol. Mass.:49910.45
Organism:Homo sapiens (Human)
Description:Q03181
Residue:441
BDBM50124391
NameBDBM50124391
Synonyms:CHEMBL176421 | {2-[4-(3-Phenyl-7-propyl-benzo[d]isoxazol-6-yloxy)-butoxy]-phenyl}-acetic acid
TypeSmall organic molecule
Emp. Form.C28H29NO5
Mol. Mass.459.5336
SMILESCCCc1c(OCCCCOc2ccccc2CC(O)=O)ccc2c(noc12)-c1ccccc1