Reaction Details
TargetPeroxisome proliferator-activated receptor delta
LigandBDBM50124392
Substrate/Competitorn/a
Meas. Tech.ChEBML_154031
Ki 136±n/a nM
Citation Adams, ADYuen, WHu, ZSantini, CJones, ABMacNaul, KLBerger, JPDoebber, TWMoller, DE Amphipathic 3-phenyl-7-propylbenzisoxazoles; human pPaR gamma, delta and alpha agonists. Bioorg Med Chem Lett13:931-5 (2003) Peroxisome proliferator-activated receptor delta
Name:Peroxisome proliferator-activated receptor delta
Type:Enzyme
Mol. Mass.:49910.45
Organism:Homo sapiens (Human)
Description:Q03181
Residue:441
BDBM50124392
NameBDBM50124392
Synonyms:2-{4-[4-(3-Phenyl-7-propyl-benzo[d]isoxazol-6-yloxy)-butoxy]-phenoxy}-propionic acid | CHEMBL369607
TypeSmall organic molecule
Emp. Form.C29H31NO6
Mol. Mass.489.5595
SMILESCCCc1c(OCCCCOc2ccc(OC(C)C(O)=O)cc2)ccc2c(noc12)-c1ccccc1