Reaction Details
TargetPeroxisome proliferator-activated receptor alpha
LigandBDBM33283
Substrate/Competitorn/a
Meas. Tech.ChEMBL_153549 (CHEMBL766090)
Ki 7.2±n/a nM
Citation Adams, ADYuen, WHu, ZSantini, CJones, ABMacNaul, KLBerger, JPDoebber, TWMoller, DE Amphipathic 3-phenyl-7-propylbenzisoxazoles; human pPaR gamma, delta and alpha agonists. Bioorg Med Chem Lett13:931-5 (2003) Peroxisome proliferator-activated receptor alpha
Name:Peroxisome proliferator-activated receptor alpha
Type:Enzyme
Mol. Mass.:52222.08
Organism:Homo sapiens (Human)
Description:Q07869
Residue:468
BDBM33283
NameBDBM33283
Synonyms:(3-{4-[(3-phenyl-7-propyl-1,2-benzisoxazol-6-yl)oxy]butoxy}phenyl)acetic acid [3H]nTZD3
Typeradiolabeled ligand
Emp. Form.C28H29NO5
Mol. Mass.459.5336
SMILESCCCc1c(OCCCCOc2cccc(CC(O)=O)c2)ccc2c(noc12)-c1ccccc1