Reaction Details
TargetPeroxisome proliferator-activated receptor alpha
LigandBDBM50124375
Substrate/Competitorn/a
Meas. Tech.ChEMBL_153242 (CHEMBL764654)
EC50 2±n/a nM
Citation Adams, ADYuen, WHu, ZSantini, CJones, ABMacNaul, KLBerger, JPDoebber, TWMoller, DE Amphipathic 3-phenyl-7-propylbenzisoxazoles; human pPaR gamma, delta and alpha agonists. Bioorg Med Chem Lett13:931-5 (2003) Peroxisome proliferator-activated receptor alpha
Name:Peroxisome proliferator-activated receptor alpha
Type:Enzyme
Mol. Mass.:52222.08
Organism:Homo sapiens (Human)
Description:Q07869
Residue:468
BDBM50124375
NameBDBM50124375
Synonyms:2-Methyl-2-{4-[4-(3-phenyl-7-propyl-benzo[d]isoxazol-6-yloxy)-butoxy]-phenyl}-propionic acid | CHEMBL368371
TypeSmall organic molecule
Emp. Form.C30H33NO5
Mol. Mass.487.5867
SMILESCCCc1c(OCCCCOc2ccc(cc2)C(C)(C)C(O)=O)ccc2c(noc12)-c1ccccc1