Reaction Details
TargetPeroxisome proliferator-activated receptor alpha
LigandBDBM50124371
Substrate/Competitorn/a
Meas. Tech.ChEBML_153549
Ki 50±n/a nM
Citation Adams, ADYuen, WHu, ZSantini, CJones, ABMacNaul, KLBerger, JPDoebber, TWMoller, DE Amphipathic 3-phenyl-7-propylbenzisoxazoles; human pPaR gamma, delta and alpha agonists. Bioorg Med Chem Lett13:931-5 (2003) Peroxisome proliferator-activated receptor alpha
Name:Peroxisome proliferator-activated receptor alpha
Type:Enzyme
Mol. Mass.:52222.08
Organism:Homo sapiens (Human)
Description:Q07869
Residue:468
BDBM50124371
NameBDBM50124371
Synonyms:(E)-3-{4-[3-(3-Phenyl-7-propyl-benzo[d]isoxazol-6-yloxy)-propoxy]-phenyl}-acrylic acid | CHEMBL172959
TypeSmall organic molecule
Emp. Form.C28H27NO5
Mol. Mass.457.5177
SMILESCCCc1c(OCCCOc2ccc(\C=C\C(O)=O)cc2)ccc2c(noc12)-c1ccccc1