Reaction Details
TargetEndothelin receptor type B
LigandBDBM50124446
Substrate/Competitorn/a
Meas. Tech.ChEBML_63699
IC50 4±n/a nM
Citation Boss, CBolli, MHWeller, TFischli, WClozel, M Bis-sulfonamides as endothelin receptor antagonists. Bioorg Med Chem Lett13:951-4 (2003) Endothelin receptor type B
Name:Endothelin receptor type B
Type:Enzyme Catalytic Domain
Mol. Mass.:49664.00
Organism:Homo sapiens (Human)
Description:ENDOTHELIN B EDNRB HUMAN::P24530
Residue:442
BDBM50124446
NameBDBM50124446
Synonyms:5-Isopropyl-pyridine-2-sulfonic acid {2-cyclopropyl-5-(2-methoxy-phenoxy)-6-[3-(thiophene-2-sulfonylamino)-propoxy]-pyrimidin-4-yl}-amide | CHEMBL367444
TypeSmall organic molecule
Emp. Form.C29H33N5O7S3
Mol. Mass.659.797
SMILESCOc1ccccc1Oc1c(NS(=O)(=O)c2ccc(cn2)C(C)C)nc(nc1OCCCNS(=O)(=O)c1cccs1)C1CC1