Reaction Details
TargetEndothelin-1 receptor
LigandBDBM50124474
Substrate/Competitorn/a
Meas. Tech.ChEBML_65486
IC50 1±n/a nM
Citation Bolli, MHBoss, CClozel, MFischli, WHess, PWeller, T The use of sulfonylamido pyrimidines incorporating an unsaturated side chain as endothelin receptor antagonists. Bioorg Med Chem Lett13:955-9 (2003) Endothelin-1 receptor
Name:Endothelin-1 receptor
Type:Enzyme Catalytic Domain
Mol. Mass.:48736.88
Organism:Homo sapiens (Human)
Description:P25101
Residue:427
BDBM50124474
NameBDBM50124474
Synonyms:CHEMBL94786 | Pyridin-2-yl-carbamic acid 4-[6-(5-isopropyl-pyridine-2-sulfonylamino)-5-(2-methoxy-phenoxy)-2-morpholin-4-yl-pyrimidin-4-yloxy]-but-2-ynyl ester
TypeSmall organic molecule
Emp. Form.C33H35N7O8S
Mol. Mass.689.738
SMILESCOc1ccccc1Oc1c(NS(=O)(=O)c2ccc(cn2)C(C)C)nc(nc1OCC#CCOC(=O)Nc1ccccn1)N1CCOCC1