Reaction Details
TargetSodium-dependent serotonin transporter
LigandBDBM50124564
Substrate/Competitorn/a
Meas. Tech.ChEMBL_201482 (CHEMBL804591)
Ki 0.05±n/a nM
Citation Goodman, MMChen, PPlisson, CMartarello, LGalt, JVotaw, JRKilts, CDMalveaux, GCamp, VMShi, BEly, TDHowell, LMcConathy, JNemeroff, CB Synthesis and characterization of iodine-123 labeled 2beta-carbomethoxy-3beta-(4'-((Z)-2-iodoethenyl)phenyl)nortropane. A ligand for in vivo imaging of serotonin transporters by single-photon-emission tomography. J Med Chem46:925-35 (2003) 
 
Sodium-dependent serotonin transporter
Name:Sodium-dependent serotonin transporter
Type:Multi-pass membrane protein
Mol. Mass.:70322.51
Organism:Homo sapiens (Human)
Description:P31645
Residue:630
BDBM50124564
NameBDBM50124564
Synonyms:CHEMBL174088 | methyl 3-{4-[2-iodo-(Z)-1-ethenyl]phenyl}-(2S,3S)-8-azabicyclo[3.2.1]octane-2-carboxylate
TypeSmall organic molecule
Emp. Form.C17H20INO2
Mol. Mass.397.2507
SMILESCOC(=O)[C@@H]1C2CCC(C[C@@H]1c1ccc(\C=C/I)cc1)N2