Reaction Details
TargetProgesterone receptor
LigandBDBM50124604
Substrate/Competitorn/a
Meas. Tech.ChEBML_159729
Ki 200±n/a nM
Citation Kym, PRKort, MECoghlan, MJMoore, JLTang, RRatajczyk, JDLarson, DPElmore, SWPratt, JKStashko, MAFalls, HDLin, CWNakane, MMiller, LTyree, CMMiner, JNJacobson, PBWilcox, DMNguyen, PLane, BC Nonsteroidal selective glucocorticoid modulators: the effect of C-10 substitution on receptor selectivity and functional potency of 5-allyl-2,5-dihydro-2,2,4-trimethyl-1H-[1]benzopyrano[3,4-f]quinolines. J Med Chem46:1016-30 (2003) 
 
Progesterone receptor
Name:Progesterone receptor
Type:Protein
Mol. Mass.:98979.52
Organism:Homo sapiens (Human)
Description:P06401
Residue:933
BDBM50124604
NameBDBM50124604
Synonyms:5-Allyl-9-fluoro-10-methoxy-2,2,4-trimethyl-2,5-dihydro-1H-6-oxa-1-aza-chrysene | CHEMBL7988
TypeSmall organic molecule
Emp. Form.C23H24FNO2
Mol. Mass.365.4406
SMILESCOc1c(F)ccc2OC(CC=C)c3c(ccc4NC(C)(C)C=C(C)c34)-c12