Reaction Details
TargetGlucocorticoid receptor
LigandBDBM50124612
Substrate/Competitorn/a
Meas. Tech.ChEMBL_71398 (CHEMBL874034)
Ki 5.4±n/a nM
Citation Kym, PRKort, MECoghlan, MJMoore, JLTang, RRatajczyk, JDLarson, DPElmore, SWPratt, JKStashko, MAFalls, HDLin, CWNakane, MMiller, LTyree, CMMiner, JNJacobson, PBWilcox, DMNguyen, PLane, BC Nonsteroidal selective glucocorticoid modulators: the effect of C-10 substitution on receptor selectivity and functional potency of 5-allyl-2,5-dihydro-2,2,4-trimethyl-1H-[1]benzopyrano[3,4-f]quinolines. J Med Chem46:1016-30 (2003) 
 
Glucocorticoid receptor
Name:Glucocorticoid receptor
Type:Enzyme
Mol. Mass.:85656.87
Organism:Homo sapiens (Human)
Description:P04150
Residue:777
BDBM50124612
NameBDBM50124612
Synonyms:5-Allyl-9-chloro-10-methoxy-2,2,4-trimethyl-2,5-dihydro-1H-6-oxa-1-aza-chrysene | CHEMBL7987
TypeSmall organic molecule
Emp. Form.C23H24ClNO2
Mol. Mass.381.895
SMILESCOc1c(Cl)ccc2OC(CC=C)c3c(ccc4NC(C)(C)C=C(C)c34)-c12