Reaction Details
TargetGlucocorticoid receptor
LigandBDBM50107347
Substrate/Competitorn/a
Meas. Tech.ChEBML_201612
EC50 48±n/a nM
Citation Kym, PRKort, MECoghlan, MJMoore, JLTang, RRatajczyk, JDLarson, DPElmore, SWPratt, JKStashko, MAFalls, HDLin, CWNakane, MMiller, LTyree, CMMiner, JNJacobson, PBWilcox, DMNguyen, PLane, BC Nonsteroidal selective glucocorticoid modulators: the effect of C-10 substitution on receptor selectivity and functional potency of 5-allyl-2,5-dihydro-2,2,4-trimethyl-1H-[1]benzopyrano[3,4-f]quinolines. J Med Chem46:1016-30 (2003) 
 
Glucocorticoid receptor
Name:Glucocorticoid receptor
Type:Enzyme Catalytic Domain
Mol. Mass.:87556.83
Organism:RAT
Description:Glucocorticoid 0 RAT::P06536
Residue:795
BDBM50107347
NameBDBM50107347
Synonyms:(+)5-Allyl-10-methoxy-2,2,4-trimethyl-2,5-dihydro-1H-6-oxa-1-aza-chrysene (-)5-Allyl-10-methoxy-2,2,4-trimethyl-2,5-dihydro-1H-6-oxa-1-aza-chrysene 5-allyl-10-methoxy-2,2,4-trimethyl-2,5-dihydro-1H-chromeno[3,4-f]quinoline | CHEMBL266282
TypeSmall organic molecule
Emp. Form.C23H25NO2
Mol. Mass.347.4501
SMILESCOc1cccc2OC(CC=C)c3c(ccc4NC(C)(C)C=C(C)c34)-c12