Reaction Details
TargetMethionine--tRNA ligase
LigandBDBM50124811
Substrate/Competitorn/a
Meas. Tech.ChEBML_105151
IC50 3.2±n/a nM
Citation Jarvest, RLBerge, JMBrown, MJBrown, PElder, JSForrest, AKHouge-Frydrych, CSO'Hanlon, PJMcNair, DJRittenhouse, SSheppard, RJ Optimisation of aryl substitution leading to potent methionyl tRNA synthetase inhibitors with excellent gram-positive antibacterial activity. Bioorg Med Chem Lett13:665-8 (2003) Methionine--tRNA ligase
Name:Methionine--tRNA ligase
Type:PROTEIN
Mol. Mass.:76245.79
Organism:Escherichia coli (strain K12)
Description:ChEMBL_400681
Residue:677
BDBM50124811
NameBDBM50124811
Synonyms:2-[3-(3-Bromo-5-iodo-benzylamino)-propylamino]-1H-quinolin-4-one | CHEMBL159197
TypeSmall organic molecule
Emp. Form.C19H19BrIN3O
Mol. Mass.512.182
SMILESOc1cc(NCCCNCc2cc(Br)cc(I)c2)nc2ccccc12