Reaction Details
TargetMethionine--tRNA ligase
LigandBDBM50124813
Substrate/Competitorn/a
Meas. Tech.ChEBML_105151
IC50 4.7±n/a nM
Citation Jarvest, RLBerge, JMBrown, MJBrown, PElder, JSForrest, AKHouge-Frydrych, CSO'Hanlon, PJMcNair, DJRittenhouse, SSheppard, RJ Optimisation of aryl substitution leading to potent methionyl tRNA synthetase inhibitors with excellent gram-positive antibacterial activity. Bioorg Med Chem Lett13:665-8 (2003) Methionine--tRNA ligase
Name:Methionine--tRNA ligase
Type:PROTEIN
Mol. Mass.:76245.79
Organism:Escherichia coli (strain K12)
Description:ChEMBL_400681
Residue:677
BDBM50124813
NameBDBM50124813
Synonyms:2-[3-(3-Bromo-2-ethoxy-5-methylsulfanyl-benzylamino)-propylamino]-1H-quinolin-4-one | CHEMBL158932
TypeSmall organic molecule
Emp. Form.C22H26BrN3O2S
Mol. Mass.476.43
SMILESCCOc1c(Br)cc(SC)cc1CNCCCNc1cc(O)c2ccccc2n1