Reaction Details
TargetMethionine--tRNA ligase
LigandBDBM50222701
Substrate/Competitorn/a
Meas. Tech.ChEMBL_105150 (CHEMBL716780)
IC50<3±n/a nM
Citation Jarvest, RLBerge, JMBrown, MJBrown, PElder, JSForrest, AKHouge-Frydrych, CSO'Hanlon, PJMcNair, DJRittenhouse, SSheppard, RJ Optimisation of aryl substitution leading to potent methionyl tRNA synthetase inhibitors with excellent gram-positive antibacterial activity. Bioorg Med Chem Lett13:665-8 (2003) Methionine--tRNA ligase
Name:Methionine--tRNA ligase
Type:PROTEIN
Mol. Mass.:76245.79
Organism:Escherichia coli (strain K12)
Description:ChEMBL_400681
Residue:677
BDBM50222701
NameBDBM50222701
Synonyms:CHEMBL158051
TypeSmall organic molecule
Emp. Form.C21H21Cl2N3O2
Mol. Mass.418.316
SMILESClc1cc(Cl)c2OCCC(NCCCNc3cc(=O)c4ccccc4[nH]3)c2c1