Reaction Details
TargetMethionine--tRNA ligase
LigandBDBM50222702
Substrate/Competitorn/a
Meas. Tech.ChEMBL_105150 (CHEMBL716780)
IC50<3±n/a nM
Citation Jarvest, RLBerge, JMBrown, MJBrown, PElder, JSForrest, AKHouge-Frydrych, CSO'Hanlon, PJMcNair, DJRittenhouse, SSheppard, RJ Optimisation of aryl substitution leading to potent methionyl tRNA synthetase inhibitors with excellent gram-positive antibacterial activity. Bioorg Med Chem Lett13:665-8 (2003) Methionine--tRNA ligase
Name:Methionine--tRNA ligase
Type:PROTEIN
Mol. Mass.:76245.79
Organism:Escherichia coli (strain K12)
Description:ChEMBL_400681
Residue:677
BDBM50222702
NameBDBM50222702
Synonyms:CHEMBL161347
TypeSmall organic molecule
Emp. Form.C21H22BrClN4O
Mol. Mass.461.783
SMILESOc1cc(NCCCNC2CCNc3c(Cl)cc(Br)cc23)nc2ccccc12