Reaction Details
TargetGlutamate receptor ionotropic, NMDA 2B
LigandBDBM50124912
Substrate/Competitorn/a
Meas. Tech.ChEMBL_141157 (CHEMBL749675)
Ki 600±n/a nM
Citation Claiborne, CFMcCauley, JALibby, BECurtis, NRDiggle, HJKulagowski, JJMichelson, SRAnderson, KDClaremon, DAFreidinger, RMBednar, RAMosser, SDGaul, SLConnolly, TMCondra, CLBednar, BStump, GLLynch, JJMacaulay, AWafford, KAKoblan, KSLiverton, NJ Orally efficacious NR2B-selective NMDA receptor antagonists. Bioorg Med Chem Lett13:697-700 (2003) Glutamate receptor ionotropic, NMDA 2B
Name:Glutamate receptor ionotropic, NMDA 2B
Type:PROTEIN
Mol. Mass.:166375.46
Organism:Homo sapiens (Human)
Description:ChEMBL_1438829
Residue:1484
BDBM50124912
NameBDBM50124912
Synonyms:CHEMBL159879 | N-(3-Chloro-benzyl)-4-fluoro-benzamidine
TypeSmall organic molecule
Emp. Form.C14H12ClFN2
Mol. Mass.262.71
SMILESNC(=NCc1cccc(Cl)c1)c1ccc(F)cc1