Reaction Details
TargetGlutamate receptor ionotropic, NMDA 2B
LigandBDBM50124926
Substrate/Competitorn/a
Meas. Tech.ChEMBL_141157 (CHEMBL749675)
Ki 480±n/a nM
Citation Claiborne, CFMcCauley, JALibby, BECurtis, NRDiggle, HJKulagowski, JJMichelson, SRAnderson, KDClaremon, DAFreidinger, RMBednar, RAMosser, SDGaul, SLConnolly, TMCondra, CLBednar, BStump, GLLynch, JJMacaulay, AWafford, KAKoblan, KSLiverton, NJ Orally efficacious NR2B-selective NMDA receptor antagonists. Bioorg Med Chem Lett13:697-700 (2003) Glutamate receptor ionotropic, NMDA 2B
Name:Glutamate receptor ionotropic, NMDA 2B
Type:PROTEIN
Mol. Mass.:166375.46
Organism:Homo sapiens (Human)
Description:ChEMBL_1438829
Residue:1484
BDBM50124926
NameBDBM50124926
Synonyms:CHEMBL159530 | N-Benzyl-4-trifluoromethyl-benzamidine
TypeSmall organic molecule
Emp. Form.C15H13F3N2
Mol. Mass.278.2723
SMILESNC(=NCc1ccccc1)c1ccc(cc1)C(F)(F)F