Reaction Details
TargetGlutamate receptor ionotropic, NMDA 2B
LigandBDBM50124892
Substrate/Competitorn/a
Meas. Tech.ChEBML_141156
Ki 9±n/a nM
Citation Claiborne, CFMcCauley, JALibby, BECurtis, NRDiggle, HJKulagowski, JJMichelson, SRAnderson, KDClaremon, DAFreidinger, RMBednar, RAMosser, SDGaul, SLConnolly, TMCondra, CLBednar, BStump, GLLynch, JJMacaulay, AWafford, KAKoblan, KSLiverton, NJ Orally efficacious NR2B-selective NMDA receptor antagonists. Bioorg Med Chem Lett13:697-700 (2003) Glutamate receptor ionotropic, NMDA 2B
Name:Glutamate receptor ionotropic, NMDA 2B
Type:PROTEIN
Mol. Mass.:166375.46
Organism:Homo sapiens (Human)
Description:ChEMBL_1438829
Residue:1484
BDBM50124892
NameBDBM50124892
Synonyms:(E)-N-Benzyl-3-phenyl-acrylamidine | CHEMBL158874
TypeSmall organic molecule
Emp. Form.C16H16N2
Mol. Mass.236.3116
SMILESN=C(NCc1ccccc1)C=Cc1ccccc1