Reaction Details
TargetGlutamate receptor ionotropic, NMDA 2B
LigandBDBM50124917
Substrate/Competitorn/a
Meas. Tech.ChEBML_141156
Ki 23±n/a nM
Citation Claiborne, CFMcCauley, JALibby, BECurtis, NRDiggle, HJKulagowski, JJMichelson, SRAnderson, KDClaremon, DAFreidinger, RMBednar, RAMosser, SDGaul, SLConnolly, TMCondra, CLBednar, BStump, GLLynch, JJMacaulay, AWafford, KAKoblan, KSLiverton, NJ Orally efficacious NR2B-selective NMDA receptor antagonists. Bioorg Med Chem Lett13:697-700 (2003) Glutamate receptor ionotropic, NMDA 2B
Name:Glutamate receptor ionotropic, NMDA 2B
Type:PROTEIN
Mol. Mass.:166375.46
Organism:Homo sapiens (Human)
Description:ChEMBL_1438829
Residue:1484
BDBM50124917
NameBDBM50124917
Synonyms:CHEMBL349727 | N-(3-Methoxy-benzyl)-4-trifluoromethoxy-benzamidine
TypeSmall organic molecule
Emp. Form.C16H15F3N2O2
Mol. Mass.324.2977
SMILESCOc1cccc(CN=C(N)c2ccc(OC(F)(F)F)cc2)c1