Reaction Details
TargetGlutamate receptor ionotropic, NMDA 2B
LigandBDBM50124927
Substrate/Competitorn/a
Meas. Tech.ChEBML_141156
Ki 3900±n/a nM
Citation Claiborne, CFMcCauley, JALibby, BECurtis, NRDiggle, HJKulagowski, JJMichelson, SRAnderson, KDClaremon, DAFreidinger, RMBednar, RAMosser, SDGaul, SLConnolly, TMCondra, CLBednar, BStump, GLLynch, JJMacaulay, AWafford, KAKoblan, KSLiverton, NJ Orally efficacious NR2B-selective NMDA receptor antagonists. Bioorg Med Chem Lett13:697-700 (2003) Glutamate receptor ionotropic, NMDA 2B
Name:Glutamate receptor ionotropic, NMDA 2B
Type:PROTEIN
Mol. Mass.:166375.46
Organism:Homo sapiens (Human)
Description:ChEMBL_1438829
Residue:1484
BDBM50124927
NameBDBM50124927
Synonyms:2-Chloro-N-(3-chloro-benzyl)-benzamidine | CHEMBL349709
TypeSmall organic molecule
Emp. Form.C14H12Cl2N2
Mol. Mass.279.164
SMILESNC(=NCc1cccc(Cl)c1)c1ccccc1Cl