Reaction Details
TargetGlutamate receptor ionotropic, NMDA 2B
LigandBDBM50124920
Substrate/Competitorn/a
Meas. Tech.ChEBML_141156
Ki 56±n/a nM
Citation Claiborne, CFMcCauley, JALibby, BECurtis, NRDiggle, HJKulagowski, JJMichelson, SRAnderson, KDClaremon, DAFreidinger, RMBednar, RAMosser, SDGaul, SLConnolly, TMCondra, CLBednar, BStump, GLLynch, JJMacaulay, AWafford, KAKoblan, KSLiverton, NJ Orally efficacious NR2B-selective NMDA receptor antagonists. Bioorg Med Chem Lett13:697-700 (2003) Glutamate receptor ionotropic, NMDA 2B
Name:Glutamate receptor ionotropic, NMDA 2B
Type:PROTEIN
Mol. Mass.:166375.46
Organism:Homo sapiens (Human)
Description:ChEMBL_1438829
Residue:1484
BDBM50124920
NameBDBM50124920
Synonyms:CHEMBL421976 | N-(2-Chloro-benzyl)-4-trifluoromethyl-benzamidine
TypeSmall organic molecule
Emp. Form.C15H12ClF3N2
Mol. Mass.312.717
SMILESNC(=NCc1ccccc1Cl)c1ccc(cc1)C(F)(F)F